���W,�W�r,�m��,���q,¾��,����,�ӰȦa�},�Ӱȹq��,��a�q��,�Ӱȶǯu,��a�ǯu,���q�`��,�M�u�q��,����q��,�Ӱȹq�l�l��,�ӰȺ��},Messenger,Skype,��L,���O,�Τ@�s��,�ʺ�,�t��,�ʧO,�嫬,�Ǿ�,�P�y,�Ƶ�
�B���v,���v,�B,ģ�P��ުѥ�����,���u�{�v,�޳N��P�@��,"�s�˿��˥_�����F�E��1 ,30251",,,(03)558-9827,,,,0918-095522,jamin-ding@a-i-t-col,www.a-i-t.com.tw,,,,���������,80073187,,,,,,,
�B���v,���v,�B,�`�P��ުѥ��������q,���u�{�v,�޳N��P�@��,"�s�˿��˥_�����F�E��145��5�� ,30251",,,(03)558-9827,,,,0918-095522,jamin-ding@a-i-t.com.tw,www.a-i-t.com.tw,,,,���������,80073187,,,,,,,
,,,,,,,,,,,,,,,www.dedipr-c,,,,���������,,,,,,,,
,,,,,,�׼Ӥ@09��,,,,,,,,,,,,,���������,27980338,,,,,,,
,,,,,,,88622,,,,,,,,,,,,���������,,,,,,,,
������,����,��,,��`�~��,�~�ȤG��,,(886)��16551688����,,,,,,,,,,,,���������,16846270,,,,,,,
������,����,��,,��`�~��,�~�ȤG��-�q���g��Ʒ~�s,�x�_���n��϶���3��5��,(886)226558688����896,,(886)T2655866,,,,N970092909,leo.wang@avnet.com,www.em.avnetasia.com,,,,���������,16846270,,,,,,,
������,����,��,�s�[�Y�Ӧw�I�Q�ѥ��������q,��`�~��,�~�ȤG��-�q���g��Ʒ~�s,,(886)226558688����896,,(886)226558666,,,,(886)970092909,leo.wang@avnet.com,www.em.avnetasia.com,,,,���������,16846270,,,,,,,
���Ӻ�,�Ӻ�,��,,�~�ȱM��,�~�ȤG��,�x�_���n��϶�ϵ�3��,(886)226558688,,(886)226531007,,,,(886)9191355,lori.huang@av.net.co,www.em.avnetasia.com,,,,���������,16846270,,,,,,,
���^��,�^��,��,,�~�ȱM��,�~�ȤG��-�u�~�Ʒ~�s,�x�_���n��϶�ϵ�3��5��,(886)226558688����254,,,,,,(886)919135594,lori.huang,www.em.av.netas,,,,���������,16846270,,,,,,,
�L����,����,�L,���Ӧw�ڬ�ުѥ��������q,�M��,�M�׺޲z�[�����}�o��,"�x�_�����v�F���T�q2-L1�� ,104",(02)2516-8887����2815,,(02)2516-9866,,,,0988-079-119,tailin@ami.com.tw,,,,,���������,96970927,,,,,,,
�L����,����,�L,�������q,�M��,�M�׺޲z�[�����}�o��,,,,(02)2516-9866,,,,0988-079-119,,,,,,���������,,,,,,,,
,,,�ߦ������q,,�M�׺޲z�[�����}�o��,,,,(02)2516-9866,,,,0988-079-119,,,,,,���������,,,,,,,,
,,,�������q,�@nuX�u�{�v,,,,,(02)2517-7787,,,,,,,,,,���������,,,,,,,,
�}����,����,�},�H�~���,�U�z�u�{�v,��o��,"�s�ˬ�Ƕ�Ϥu�~�F�|��15��2�� ,300",03-578-9562����:830,,,,,,,jay_xu@aspe-edtech.com,www.aspeedtech.con,,,,���������,27490748,,,,,,,
,,,A�tc�p�ƹq�l�ѥ��������q,�Ʋz,���y�~�ȳB,,(03)5679966����:322,,(03)6120008,,,,915861989,nymph-lu@amic.com.tw,www.amictechnology.com,,,,���������,16130036,,,,,,,
,,,A�tc�p�ƹq�l�ѥ��������q,,,"�s�ˬ�Ǥu�~��ϤO�椻���G�� ,300",(03)5679966����:322,,(03)6120008,,,,,nymph_lu@amic.com.tw,www.amictechnology.com,,,,���������,,,,,,,,
�f���f,���f,�f,�۳�����A�tc�p�ƹq�l�ѥ��������q,�Ʋz,���y�~�ȳB,"�s�ˬ�Ǥu�~��ϤO�椻���G�� ,300",(03)5679966����:322,,(03)6120008,,,,915861989,nymph_lu@amic.com.tw,www.amictechnology.com,,,,���������,16130036,,,,,,,
,,,A�tc�p�ƹq�l�ѥ��������q,�Ʋz,���y�~�ȳB,,(03)5679966����:322,,(03)6120008,,,,915861989,nymph-lu@amic.com.tw,www.amictechnology.com,,,,���������,16130036,,,,,,,
,,,�p�ƹq�l�ѥ��������q,�ӯŤu�{�v,���~���ά�o�u�{�B,�s�ˬ�Ǥu�~��ϤO�椻���G��,886-35679966ext.383,,,,,,,jjesse_yeh@amic.com.tw,www.amictechnology.com,,,,���������,,,,,,,,
�H�@�d,�@�d,�H,�x�W�ɱ��q�l�ѥ��������q,�~�ȱM��,,�x�_���s�����_����235��3��6��,(06)243-3950,,(06)243-0141,,,,0922-437854,gary-teng@timespeed.com.tw,www.timespeed.com.tw,,,,���������,86382604,,,,,,,
,,,�s�R�߯q��ަ������q,�O�~�u�{�v,,�����M�Ϥ�����509��3��,(886)266205322#204,,(886)266205377,,,,0919-325609,e.chan@ace-ele.com,www.ace-ele.com,,,,���������,25089142,,,,,,,
��A��,�A��,��,�x�W�R�߯q��ަ������q,���~�u�{�v,,�s�_�����M�Ϥ�����509��3��,(886)266205322#204,,,,,,0919-325609,mike.chan@ace-ele.com,www.ace-ele.com,,,,���������,25089142,,,,,,,
���ث�,�ث�,��,�q�֬�ުѥ��������q,��`�~�Ȥu�{�v,,"�x�_���s����ϰ���1����8�� ,11",(02)8751-Mext.4912,,,,,,,terence.wan@d.com.tw,anxod.com.tw,,,,���������,27341760,,,,,,,
,,,,,,,,,,,,,,,,,,,���������,,,,,,,,
���ث�,�ث�,��,�q�֬�ުѥ��������q,��`�~�Ȥu�{�v,,,(02)8751-Mext.4912,,(02)772,,,,,terence.wan@d.can.tw,atmd.can.tw,,,,���������,27341760,,,,,,,
���ɤ�,�ɤ�,��,�k����ުѥ��������q,�g�z,���~������,"�x�_������s�x���� ,221",02-26982526,,02-26982528,,,,,raphael@anstek.com.tw,www.anstek.com.tw,,,,���������,12676056,,,,,,,
�@,,,�E����ުѥ��������q,BU2�~�ȰƲz,,�x�_������ϰ���37��1��,(886)2-8797-2728,,(886)2-8797-7511,,,,0975-359-310,kevin_lai@atm-tw.com,www.am-tw.com,,,,���������,97282244,,,,,,,
,,,,,,,,,,,,,,,,,,,���������,,,,,,,,
�����M,���M,��,�H�~���,�޲z�v,�s�w��,"�s�ˬ�Ƕ�Ϥu�~�F�|��15��2�� ,30077",03-578-9568����:818,,03.578.9586,,,,,grace_wang@aspeedtech.com,www.aspeedtech.com,,,,���������,27490748,,,,,,,
